# Package org.nd4j.tensorflow.conversion.graphrunner does not exist

**URL:** <https://community.konduit.ai/t/package-org-nd4j-tensorflow-conversion-graphrunner-does-not-exist/1513>\
**Category:** DL4J\
**Created:** [July 24, 2021, 9:00pm UTC](https://community.konduit.ai/t/package-org-nd4j-tensorflow-conversion-graphrunner-does-not-exist/1513 "2021-07-24T21:00:12Z")\
**Posts on this page:** 6\
**Page:** 1

<div class="post-metadata">

**Author:** ![craig88](https://avatars.discourse-cdn.com/v4/letter/c/b782af/32.png) [@craig88](https://community.konduit.ai/u/craig88)\
**Post date:** [July 24, 2021, 9:00pm UTC](https://community.konduit.ai/t/package-org-nd4j-tensorflow-conversion-graphrunner-does-not-exist/1513/1 "2021-07-24T21:00:12Z")

</div>

On Windows10, IntelliJ, Java 1.8, working through tensorflow-keras-import-examples and get above error. I’ve double checked the pom uses 1.0.0-beta7

---

<div class="post-metadata">

**Author:** ![agibsonccc](https://yyz1.discourse-cdn.com/flex035/user_avatar/community.konduit.ai/agibsonccc/32/697_2.png) [@agibsonccc](https://community.konduit.ai/u/agibsonccc)\
**Post date:** [July 25, 2021, 12:01pm UTC](https://community.konduit.ai/t/package-org-nd4j-tensorflow-conversion-graphrunner-does-not-exist/1513/2 "2021-07-25T12:01:24Z")

</div>

@craig88 the dependencies look right in the examples. Could you paste a full stack trace? I suspect there’s another cause here.

How are you running it? Intellij?

---

<div class="post-metadata">

**Author:** ![craig88](https://avatars.discourse-cdn.com/v4/letter/c/b782af/32.png) [@craig88](https://community.konduit.ai/u/craig88)\
**Post date:** [July 26, 2021, 8:54pm UTC](https://community.konduit.ai/t/package-org-nd4j-tensorflow-conversion-graphrunner-does-not-exist/1513/3 "2021-07-26T20:54:21Z")

</div>

Running IntelliJ on Windows, whenever I build/rebuild get this:  
C:\DL4J\tensorflow-keras-import-examples\src\main\java\org\deeplearning4j\modelimportexamples\tf\advanced\tfgraphrunnerinjava\TFGraphRunnerExample.java:49:13  
java: cannot find symbol  
symbol: class GraphRunner  
location: class org.deeplearning4j.modelimportexamples.tf.advanced.tfgraphrunnerinjava.TFGraphRunnerExample

---

<div class="post-metadata">

**Author:** ![agibsonccc](https://yyz1.discourse-cdn.com/flex035/user_avatar/community.konduit.ai/agibsonccc/32/697_2.png) [@agibsonccc](https://community.konduit.ai/u/agibsonccc)\
**Post date:** [July 27, 2021, 12:26pm UTC](https://community.konduit.ai/t/package-org-nd4j-tensorflow-conversion-graphrunner-does-not-exist/1513/4 "2021-07-27T12:26:53Z")

</div>

@craig88 I’m still not seeing that. The whole example set compiles just fine. That class specifically comes from the nd4j-tensorflow module. Maybe just try running from normal maven command line? It seems like your IDE configuration is broken.

---

<div class="post-metadata">

**Author:** ![craig88](https://avatars.discourse-cdn.com/v4/letter/c/b782af/32.png) [@craig88](https://community.konduit.ai/u/craig88)\
**Post date:** [July 27, 2021, 8:27pm UTC](https://community.konduit.ai/t/package-org-nd4j-tensorflow-conversion-graphrunner-does-not-exist/1513/5 "2021-07-27T20:27:00Z")

</div>

I installed the exact JDK version listed in the Quickstart:  
mvn -v  
Apache Maven 3.8.1 (05c21c65bdfed0f71a2f2ada8b84da59348c4c5d)  
Maven home: C:\apache-maven-3.8.1\bin..  
Java version: 1.8.0\_301, vendor: Oracle Corporation, runtime: C:\Program Files\Java\jdk1.8.0\_301\jre  
Default locale: en\_US, platform encoding: Cp1252  
OS name: “windows 10”, version: “10.0”, arch: “amd64”, family: “windows”

running: mvn -X install :  
[ERROR] COMPILATION ERROR :  
[INFO] -------------------------------------------------------------  
[ERROR] /C:/DL4J/tensorflow-keras-import-examples/src/main/java/org/deeplearning4j/modelimportexamples/tf/advanced/tfgraphrunnerinjava/TFGraphRunnerExample.java:[49,13] cannot find symbol  
symbol: class GraphRunner  
location: class org.deeplearning4j.modelimportexamples.tf.advanced.tfgraphrunnerinjava.TFGraphRunnerExample  
[ERROR] /C:/DL4J/tensorflow-keras-import-examples/src/main/java/org/deeplearning4j/modelimportexamples/tf/advanced/tfgraphrunnerinjava/TFGraphRunnerExample.java:[49,39] cannot find symbol  
symbol: variable GraphRunner  
location: class org.deeplearning4j.modelimportexamples.tf.advanced.tfgraphrunnerinjava.TFGraphRunnerExample  
[INFO] 2 errors  
[INFO] -------------------------------------------------------------  
[INFO] ------------------------------------------------------------------------  
[INFO] BUILD FAILURE  
[INFO] ------------------------------------------------------------------------  
[INFO] Total time: 9.550 s  
[INFO] Finished at: 2021-07-27T15:18:48-05:00  
[INFO] ------------------------------------------------------------------------  
[ERROR] Failed to execute goal org.apache.maven.plugins:maven-compiler-plugin:3.6.1:compile (default-compile) on project samediff-examples: Compilation failure: Compilation failure:  
[ERROR] /C:/DL4J/tensorflow-keras-import-examples/src/main/java/org/deeplearning4j/modelimportexamples/tf/advanced/tfgraphrunnerinjava/TFGraphRunnerExample.java:[49,13] cannot find symbol  
[ERROR] symbol: class GraphRunner  
[ERROR] location: class org.deeplearning4j.modelimportexamples.tf.advanced.tfgraphrunnerinjava.TFGraphRunnerExample  
[ERROR] /C:/DL4J/tensorflow-keras-import-examples/src/main/java/org/deeplearning4j/modelimportexamples/tf/advanced/tfgraphrunnerinjava/TFGraphRunnerExample.java:[49,39] cannot find symbol  
[ERROR] symbol: variable GraphRunner  
[ERROR] location: class org.deeplearning4j.modelimportexamples.tf.advanced.tfgraphrunnerinjava.TFGraphRunnerExample  
[ERROR] → [Help 1]  
org.apache.maven.lifecycle.LifecycleExecutionException: Failed to execute goal org.apache.maven.plugins:maven-compiler-plugin:3.6.1:compile (default-compile) on project samediff-examples: Compilation failure  
at org.apache.maven.lifecycle.internal.MojoExecutor.execute (MojoExecutor.java:215)  
at org.apache.maven.lifecycle.internal.MojoExecutor.execute (MojoExecutor.java:156)  
at org.apache.maven.lifecycle.internal.MojoExecutor.execute (MojoExecutor.java:148)  
at org.apache.maven.lifecycle.internal.LifecycleModuleBuilder.buildProject (LifecycleModuleBuilder.java:117)  
at org.apache.maven.lifecycle.internal.LifecycleModuleBuilder.buildProject (LifecycleModuleBuilder.java:81)  
at org.apache.maven.lifecycle.internal.builder.singlethreaded.SingleThreadedBuilder.build (SingleThreadedBuilder.java:56)  
at org.apache.maven.lifecycle.internal.LifecycleStarter.execute (LifecycleStarter.java:128)  
at org.apache.maven.DefaultMaven.doExecute (DefaultMaven.java:305)  
at org.apache.maven.DefaultMaven.doExecute (DefaultMaven.java:192)  
at org.apache.maven.DefaultMaven.execute (DefaultMaven.java:105)  
at org.apache.maven.cli.MavenCli.execute (MavenCli.java:957)  
at org.apache.maven.cli.MavenCli.doMain (MavenCli.java:289)  
at org.apache.maven.cli.MavenCli.main (MavenCli.java:193)  
at sun.reflect.NativeMethodAccessorImpl.invoke0 (Native Method)  
at sun.reflect.NativeMethodAccessorImpl.invoke (NativeMethodAccessorImpl.java:62)  
at sun.reflect.DelegatingMethodAccessorImpl.invoke (DelegatingMethodAccessorImpl.java:43)  
at java.lang.reflect.Method.invoke (Method.java:498)  
at org.codehaus.plexus.classworlds.launcher.Launcher.launchEnhanced (Launcher.java:282)  
at org.codehaus.plexus.classworlds.launcher.Launcher.launch (Launcher.java:225)  
at org.codehaus.plexus.classworlds.launcher.Launcher.mainWithExitCode (Launcher.java:406)  
at org.codehaus.plexus.classworlds.launcher.Launcher.main (Launcher.java:347)  
Caused by: org.apache.maven.plugin.compiler.CompilationFailureException: Compilation failure  
at org.apache.maven.plugin.compiler.AbstractCompilerMojo.execute (AbstractCompilerMojo.java:1029)  
at org.apache.maven.plugin.compiler.CompilerMojo.execute (CompilerMojo.java:137)  
at org.apache.maven.plugin.DefaultBuildPluginManager.executeMojo (DefaultBuildPluginManager.java:137)  
at org.apache.maven.lifecycle.internal.MojoExecutor.execute (MojoExecutor.java:210)  
at org.apache.maven.lifecycle.internal.MojoExecutor.execute (MojoExecutor.java:156)  
at org.apache.maven.lifecycle.internal.MojoExecutor.execute (MojoExecutor.java:148)  
at org.apache.maven.lifecycle.internal.LifecycleModuleBuilder.buildProject (LifecycleModuleBuilder.java:117)  
at org.apache.maven.lifecycle.internal.LifecycleModuleBuilder.buildProject (LifecycleModuleBuilder.java:81)  
at org.apache.maven.lifecycle.internal.builder.singlethreaded.SingleThreadedBuilder.build (SingleThreadedBuilder.java:56)  
at org.apache.maven.lifecycle.internal.LifecycleStarter.execute (LifecycleStarter.java:128)  
at org.apache.maven.DefaultMaven.doExecute (DefaultMaven.java:305)  
at org.apache.maven.DefaultMaven.doExecute (DefaultMaven.java:192)  
at org.apache.maven.DefaultMaven.execute (DefaultMaven.java:105)  
at org.apache.maven.cli.MavenCli.execute (MavenCli.java:957)  
at org.apache.maven.cli.MavenCli.doMain (MavenCli.java:289)  
at org.apache.maven.cli.MavenCli.main (MavenCli.java:193)  
at sun.reflect.NativeMethodAccessorImpl.invoke0 (Native Method)  
at sun.reflect.NativeMethodAccessorImpl.invoke (NativeMethodAccessorImpl.java:62)  
at sun.reflect.DelegatingMethodAccessorImpl.invoke (DelegatingMethodAccessorImpl.java:43)  
at java.lang.reflect.Method.invoke (Method.java:498)  
at org.codehaus.plexus.classworlds.launcher.Launcher.launchEnhanced (Launcher.java:282)  
at org.codehaus.plexus.classworlds.launcher.Launcher.launch (Launcher.java:225)  
at org.codehaus.plexus.classworlds.launcher.Launcher.mainWithExitCode (Launcher.java:406)  
at org.codehaus.plexus.classworlds.launcher.Launcher.main (Launcher.java:347)

---

<div class="post-metadata">

**Author:** ![agibsonccc](https://yyz1.discourse-cdn.com/flex035/user_avatar/community.konduit.ai/agibsonccc/32/697_2.png) [@agibsonccc](https://community.konduit.ai/u/agibsonccc)\
**Post date:** [July 28, 2021, 12:58am UTC](https://community.konduit.ai/t/package-org-nd4j-tensorflow-conversion-graphrunner-does-not-exist/1513/6 "2021-07-28T00:58:02Z")

</div>

@craig88 appreciated. Could you try the updated examples? I Just pushed an update to the examples that migrates it to the latest version. Thanks!
